ArchiveOrangemail archive

kde-dashboard.kde.org


(List home) (Recent threads) (157 other KDE lists)

Subscription Options

  • RSS or Atom: Read-only subscription using a browser or aggregator. This is the recommended way if you don't need to send messages to the list. You can learn more about feed syndication and clients here.
  • Conventional: All messages are delivered to your mail address, and you can reply. To subscribe, send an email to the list's subscribe address with "subscribe" in the subject line, or visit the list's homepage here.
  • This list contains about 23,484 messages, beginning Jun 2006
  • This list doesn't seem to be active
Report the Spam
This button sends a spam report to the moderator. Please use it sparingly. For other removal requests, read this.
Are you sure? yes no

Failed trunk/playground-games r654900

Ad
Dirk Mueller 1176806664Tue, 17 Apr 2007 10:44:24 +0000 (UTC)
architecture i386 failed with:


playground-games-654900/ksudoku/src/gui/views/ksudokuview.cpp:172: warning: comparison between signed and unsigned integer expressions
Scanning dependencies of target ksirk
Linking CXX static library ../../lib/libai.a
playground-games-654900/kttt/src/kttt.cpp: In constructor 'kttt::kttt()':
playground-games-654900/kttt/src/kttt.cpp:33: error: 'actionCollection' was not declared in this scope
playground-games-654900/kttt/src/kttt.cpp:41: error: 'Keys' was not declared in this scope
playground-games-654900/kttt/src/kttt.cpp:41: error: 'StatusBar' was not declared in this scope
playground-games-654900/kttt/src/kttt.cpp:41: error: 'Save' was not declared in this scope
playground-games-654900/kttt/src/kttt.cpp:41: error: 'Create' was not declared in this scope
playground-games-654900/kttt/src/kttt.cpp:41: error: 'setupGUI' was not declared in this scope
playground-games-654900/kttt/src/kttt.cpp: In member function 'void kttt::newGame()':
playground-games-654900/kttt/src/kttt.cpp:56: error: 'actionCollection' was not declared in this scope
playground-games-654900/kttt/src/kttt.cpp: In member function 'void kttt::endGame()':
playground-games-654900/kttt/src/kttt.cpp:62: error: 'actionCollection' was not declared in this scope
playground-games-654900/kttt/src/kttt.cpp: In member function 'void kttt::playerwin(int, bool)':
playground-games-654900/kttt/src/kttt.cpp:78: error: 'actionCollection' was not declared in this scope
playground-games-654900/kttt/src/kttt.cpp: In member function 'void kttt::humanwin()':
playground-games-654900/kttt/src/kttt.cpp:84: error: 'actionCollection' was not declared in this scope
playground-games-654900/kttt/src/kttt.cpp: In member function 'void kttt::humanloose()':
playground-games-654900/kttt/src/kttt.cpp:90: error: 'actionCollection' was not declared in this scope
/usr/src/packages/BUILD/playground-games-654900/ksirk/ksirk/GameLogic/aiColsonPlayer.cpp:1553: warning: comparison between signed and unsigned integer expressions
/usr/src/packages/BUILD/playground-games-654900/ksirk/ksirk/GameLogic/aiColsonPlayer.cpp:1572: warning: comparison between signed and unsigned integer expressions
/usr/src/packages/BUILD/playground-games-654900/ksirk/ksirk/GameLogic/aiColsonPlayer.cpp:1590: warning: comparison between signed and unsigned integer expressions
/usr/src/packages/BUILD/playground-games-654900/ksirk/ksirk/GameLogic/aiColsonPlayer.cpp:1609: warning: comparison between signed and unsigned integer expressions
/usr/src/packages/BUILD/playground-games-654900/ksirk/ksirk/GameLogic/aiColsonPlayer.cpp: In member function 'bool Ksirk::GameLogic::AIColsonPlayer::Move()':
/usr/src/packages/BUILD/playground-games-654900/ksirk/ksirk/GameLogic/aiColsonPlayer.cpp:1740: warning: comparison between signed and unsigned integer expressions
/usr/src/packages/BUILD/playground-games-654900/ksirk/ksirk/GameLogic/aiColsonPlayer.cpp:1767: warning: comparison between signed and unsigned integer expressions
/usr/src/packages/BUILD/playground-games-654900/ksirk/ksirk/GameLogic/aiColsonPlayer.cpp:1785: warning: comparison between signed and unsigned integer expressions
/usr/src/packages/BUILD/playground-games-654900/ksirk/ksirk/GameLogic/aiColsonPlayer.cpp: In member function 'virtual void Ksirk::GameLogic::AIColsonPlayer::finalize()':
/usr/src/packages/BUILD/playground-games-654900/ksirk/ksirk/GameLogic/aiColsonPlayer.cpp:2024: warning: comparison between signed and unsigned integer expressions
/usr/src/packages/BUILD/playground-games-654900/ksirk/ksirk/kgamewin.cpp: In constructor 'Ksirk::KGameWindow::KGameWindow(QWidget*)':
/usr/src/packages/BUILD/playground-games-654900/ksirk/ksirk/kgamewin.cpp:145: error: 'setupGUI' was not declared in this scope
ICECC[7176] 10:43:23: Compiled on 10.11.0.142
make[2]: *** [ksirk/ksirk/CMakeFiles/ksirk.dir/kgamewin.o] Error 1
make[2]: *** Waiting for unfinished jobs....
make[1]: *** [ksirk/ksirk/CMakeFiles/ksirk.dir/all] Error 2
make: *** [all] Error 2


RPM build errors:
Last revision successfully built: 654398
Current revision                : 654900
Status overview: http://developer.kde.org/~dirk/dashboard/
Home | About | Privacy